BDBM50341436 2-(1-Naphthylsulfonyl)-1,2,3,4-tetrahydro-7-isoquinolinol::CHEMBL1766976
SMILES Oc1ccc2CCN(Cc2c1)S(=O)(=O)c1cccc2ccccc12
InChI Key InChIKey=OPXIBUXFOQDYCZ-UHFFFAOYSA-N
Data  2 EC50
  Tab Delimited (TSV)   2D SDfile   Computed 3D by Vconf -m prep SDfile
Find this compound or compounds like it in BindingDB:
Activity Spreadsheet -- Enzyme Inhibition Constant Data from BindingDB
Found 2 hits for monomerid = 50341436
TargetEstrogen receptor(Homo sapiens (Human))
Technische Universiteit Eindhoven
Curated by ChEMBL
LigandPNGBDBM50341436(2-(1-Naphthylsulfonyl)-1,2,3,4-tetrahydro-7-isoqui...)
Affinity DataEC50:  6.00E+5nM. Assay description: Agonist activity at human N-terminal His6-tagged ERalpha receptor LBD expressed in Escherichia coli BL21 (DE3) assessed as induction of SRC1 peptide ...
In DepthDetails ArticlePubMed
TargetEstrogen receptor beta(Homo sapiens (Human))
Technische Universiteit Eindhoven
Curated by ChEMBL
LigandPNGBDBM50341436(2-(1-Naphthylsulfonyl)-1,2,3,4-tetrahydro-7-isoqui...)
Affinity DataEC50:  3.00E+4nM. Assay description: Agonist activity at human N-terminal His6-tagged ERbeta receptor LBD expressed in Escherichia coli BL21 (DE3) assessed as induction of SRC1 peptide r...
In DepthDetails ArticlePubMed