BDBM50341438 2-(methylsulfonyl)-1,2,3,4-tetrahydroisoquinolin-6-ol::CHEMBL1766966
SMILES CS(=O)(=O)N1CCc2cc(O)ccc2C1
InChI Key InChIKey=UQUVGFXRCJRBSJ-UHFFFAOYSA-N
Data  2 EC50
  Tab Delimited (TSV)   2D SDfile   Computed 3D by Vconf -m prep SDfile
Find this compound or compounds like it in BindingDB:
Activity Spreadsheet -- Enzyme Inhibition Constant Data from BindingDB
Found 2 hits for monomerid = 50341438
TargetEstrogen receptor(Homo sapiens (Human))
Technische Universiteit Eindhoven
Curated by ChEMBL
LigandPNGBDBM50341438(2-(methylsulfonyl)-1,2,3,4-tetrahydroisoquinolin-6...)
Affinity DataEC50:  1.70E+5nM. Assay description: Agonist activity at human N-terminal His6-tagged ERalpha receptor LBD expressed in Escherichia coli BL21 (DE3) assessed as induction of SRC1 peptide ...
In DepthDetails ArticlePubMed
TargetEstrogen receptor beta(Homo sapiens (Human))
Technische Universiteit Eindhoven
Curated by ChEMBL
LigandPNGBDBM50341438(2-(methylsulfonyl)-1,2,3,4-tetrahydroisoquinolin-6...)
Affinity DataEC50:  2.00E+4nM. Assay description: Agonist activity at human N-terminal His6-tagged ERbeta receptor LBD expressed in Escherichia coli BL21 (DE3) assessed as induction of SRC1 peptide r...
In DepthDetails ArticlePubMed