BDBM50341512 (R)-N-(4-(4-Phenylbenzoylamino)butyl)-N-propyl-5-amino-4,5,6,7-tetrahydropyrazolo[1,5-a]pyridine::CHEMBL1765634
SMILES CCCN(CCCCNC(=O)c1ccc(cc1)-c1ccccc1)[C@@H]1CCn2nccc2C1
InChI Key InChIKey=UTFOVXIJDJSMKK-RUZDIDTESA-N
Data  5 KI  1 EC50
  Tab Delimited (TSV)   2D SDfile   Computed 3D by Vconf -m prep SDfile
Find this compound or compounds like it in BindingDB:
Activity Spreadsheet -- Enzyme Inhibition Constant Data from BindingDB
Found 6 hits for monomerid = 50341512
TargetD(3) dopamine receptor(Homo sapiens (Human))
Friedrich-Alexander University
Curated by ChEMBL
LigandPNGBDBM50341512((R)-N-(4-(4-Phenylbenzoylamino)butyl)-N-propyl-5-a...)
Affinity DataKi:  6.30nM. Assay description: Displacement of [3H]7-OH-DPAT from human dopamine D3 receptor expressed in CHO cells after 60 mins
In DepthDetails ArticlePubMed
TargetD(3) dopamine receptor(Homo sapiens (Human))
Friedrich-Alexander University
Curated by ChEMBL
LigandPNGBDBM50341512((R)-N-(4-(4-Phenylbenzoylamino)butyl)-N-propyl-5-a...)
Affinity DataKi:  15nM. Assay description: Displacement of [3H]spiperone from human dopamine D3 receptor expressed in CHO cells after 60 mins
In DepthDetails ArticlePubMed
TargetD(3) dopamine receptor(Homo sapiens (Human))
Friedrich-Alexander University
Curated by ChEMBL
LigandPNGBDBM50341512((R)-N-(4-(4-Phenylbenzoylamino)butyl)-N-propyl-5-a...)
Affinity DataKi:  19nM. Assay description: Displacement of [3H]spiperone from wild type human dopamine D3 receptor expressed in HEK293 cells after 60 mins
In DepthDetails ArticlePubMed
TargetD(2) dopamine receptor(Homo sapiens (Human))
Friedrich-Alexander University
Curated by ChEMBL
LigandPNGBDBM50341512((R)-N-(4-(4-Phenylbenzoylamino)butyl)-N-propyl-5-a...)
Affinity DataKi:  49nM. Assay description: Displacement of [3H]7-OH-DPAT from human dopamine D2long receptor expressed in CHO cells after 60 mins
In DepthDetails ArticlePubMed
TargetD(2) dopamine receptor(Homo sapiens (Human))
Friedrich-Alexander University
Curated by ChEMBL
LigandPNGBDBM50341512((R)-N-(4-(4-Phenylbenzoylamino)butyl)-N-propyl-5-a...)
Affinity DataKi:  300nM. Assay description: Displacement of [3H]spiperone from human dopamine D2long receptor expressed in CHO cells after 60 mins
In DepthDetails ArticlePubMed
TargetD(3) dopamine receptor(Homo sapiens (Human))
Friedrich-Alexander University
Curated by ChEMBL
LigandPNGBDBM50341512((R)-N-(4-(4-Phenylbenzoylamino)butyl)-N-propyl-5-a...)
Affinity DataEC50:  51nM. Assay description: Agonist activity at human dopamine D3 receptor expressed in HEK293 cells co-expressing Galphao1 assessed as incorporation of [35S]GTPgammaS into Galp...
In DepthDetails ArticlePubMed