BDBM50341561 (R)-7-chloro-3-(3,5-dimethylphenyl)-4-(2-(piperidin-2-yl)ethoxy)-N-(pyrimidin-4-yl)quinoline-6-carboxamide::CHEMBL1766108
SMILES Cc1cc(C)cc(c1)-c1cnc2cc(Cl)c(cc2c1OCC[C@H]1CCCCN1)C(=O)Nc1ccncn1
InChI Key InChIKey=BMJFEESLJOXGMQ-OAQYLSRUSA-N
Data  1 KI  1 IC50
  Tab Delimited (TSV)   2D SDfile   Computed 3D by Vconf -m prep SDfile
Find this compound or compounds like it in BindingDB:
Activity Spreadsheet -- Enzyme Inhibition Constant Data from BindingDB
Found 2 hits for monomerid = 50341561
TargetSomatostatin receptor type 2(Homo sapiens (Human))
Merck Research Laboratories
Curated by ChEMBL
LigandPNGBDBM50341561((R)-7-chloro-3-(3,5-dimethylphenyl)-4-(2-(piperidi...)
Affinity DataKi:  20nM. Assay description: Displacement of I125-somatostatin-14 from human SST2 expressed in CHO cells after 3 hrs by scintillation counting
In DepthDetails ArticlePubMed
TargetGonadotropin-releasing hormone receptor(Homo sapiens (Human))
Merck Research Laboratories
Curated by ChEMBL
LigandPNGBDBM50341561((R)-7-chloro-3-(3,5-dimethylphenyl)-4-(2-(piperidi...)
Affinity DataIC50:  2.44E+3nM. Assay description: Antagonist activity at GnRH receptor by GnRH
In DepthDetails ArticlePubMed