BDBM50342646 6-(4-(4-methylpiperazin-1-yl)phenyl)-1,2,3,4-tetrahydroisoquinoline::CHEMBL1770749
SMILES CN1CCN(CC1)c1ccc(cc1)-c1ccc2CNCCc2c1
InChI Key InChIKey=GFZHXMUKPAUUSO-UHFFFAOYSA-N
Data  1 IC50
  Tab Delimited (TSV)   2D SDfile   Computed 3D by Vconf -m prep SDfile
Find this compound or compounds like it in BindingDB:
Activity Spreadsheet -- Enzyme Inhibition Constant Data from BindingDB
Found 1 hit for monomerid = 50342646
TargetAcid-sensing ion channel 3(Homo sapiens (Human))
Merck Research Laboratories
Curated by ChEMBL
LigandPNGBDBM50342646(6-(4-(4-methylpiperazin-1-yl)phenyl)-1,2,3,4-tetra...)
Affinity DataIC50:  1.44E+4nM. Assay description: Inhibition of human ASIC3 expressed in HEK293 cells assessed as inhibition of acid-evoked current by manual patch-clamp electrophysiology assay
In DepthDetails ArticlePubMed