BDBM50342824 (2S,3S,11bR)-3-Isobutyl-9,10-dimethoxy-1,3,4,6,7,11bhexahydro-2H-pyrido[2,1-a]isoquinolin-2-ol::CHEMBL1770805
SMILES COc1cc2CCN3C[C@H](CC(C)C)[C@@H](O)C[C@@H]3c2cc1OC
InChI Key InChIKey=WEQLWGNDNRARGE-UAGQMJEPSA-N
Data  1 KI
  Tab Delimited (TSV)   2D SDfile   Computed 3D by Vconf -m prep SDfile
Find this compound or compounds like it in BindingDB:
Activity Spreadsheet -- Enzyme Inhibition Constant Data from BindingDB
Found 1 hit for monomerid = 50342824
TargetSynaptic vesicular amine transporter(Rattus norvegicus (Rat))
China Pharmaceutical University
Curated by ChEMBL
LigandPNGBDBM50342824((2S,3S,11bR)-3-Isobutyl-9,10-dimethoxy-1,3,4,6,7,1...)
Affinity DataKi:  593nM. Assay description: Displacement of [3H]DHTBZ from Sprague-Dawley rat striatum VMAT2 after 1 hr by liquid scintillation counting
In DepthDetails ArticlePubMed