BDBM50342992 (R)-N4-isopropyl-6-(3-(methylamino)pyrrolidin-1-yl)pyrimidine-2,4-diamine::CHEMBL1770977
SMILES CN[C@@H]1CCN(C1)c1cc(NC(C)C)nc(N)n1
InChI Key InChIKey=XOJGZLKPRQBGOK-SECBINFHSA-N
Data  1 KI  1 EC50
  Tab Delimited (TSV)   2D SDfile   Computed 3D by Vconf -m prep SDfile
Find this compound or compounds like it in BindingDB:
Activity Spreadsheet -- Enzyme Inhibition Constant Data from BindingDB
Found 2 hits for monomerid = 50342992
TargetHistamine H4 receptor(Homo sapiens (Human))
Johnson & Johnson Pharmaceutical Research & Development
Curated by ChEMBL
LigandPNGBDBM50342992((R)-N4-isopropyl-6-(3-(methylamino)pyrrolidin-1-yl...)
Affinity DataKi:  3nM. Assay description: Displacement of [3H]histamine from human histamine H4 receptor
In DepthDetails ArticlePubMed
TargetHistamine H4 receptor(Homo sapiens (Human))
Johnson & Johnson Pharmaceutical Research & Development
Curated by ChEMBL
LigandPNGBDBM50342992((R)-N4-isopropyl-6-(3-(methylamino)pyrrolidin-1-yl...)
Affinity DataEC50: >1.00E+4nM. Assay description: Agonist activity at human histamine H4 receptor expressed in human SK-N-MC cells assessed as effect on forskolin-induced cAMP accumulation after 6 hr...
In DepthDetails ArticlePubMed