BDBM50343199 CHEMBL1773601::N-(6-(3-(4-Methoxyphenylsulfonamido)phenyl)benzo[d]thiazol-2-yl)acetamide
SMILES COc1ccc(cc1)S(=O)(=O)Nc1cccc(c1)-c1ccc2nc(NC(C)=O)sc2c1
InChI Key InChIKey=AJYCJBFSBQHKOS-UHFFFAOYSA-N
Data  1 KI  2 IC50
  Tab Delimited (TSV)   2D SDfile   Computed 3D by Vconf -m prep SDfile
Find this compound or compounds like it in BindingDB:
Activity Spreadsheet -- Enzyme Inhibition Constant Data from BindingDB
Found 3 hits for monomerid = 50343199
LigandPNGBDBM50343199(CHEMBL1773601 | N-(6-(3-(4-Methoxyphenylsulfonamid...)
Affinity DataKi:  48nM. Assay description: Inhibition of human PI3Kalpha expressed in Sf9 cells
In DepthDetails ArticlePubMed
TargetSerine/threonine-protein kinase mTOR(Homo sapiens (Human))
Amgen
Curated by ChEMBL
LigandPNGBDBM50343199(CHEMBL1773601 | N-(6-(3-(4-Methoxyphenylsulfonamid...)
Affinity DataIC50:  1.50E+3nM. Assay description: Inhibition of mTOR assessed as inhibition of 4EBP1 phosphorylation by TR-FRET assay
In DepthDetails ArticlePubMed
TargetRAC-alpha serine/threonine-protein kinase(Homo sapiens (Human))
Amgen
Curated by ChEMBL
LigandPNGBDBM50343199(CHEMBL1773601 | N-(6-(3-(4-Methoxyphenylsulfonamid...)
Affinity DataIC50:  1.16E+3nM. Assay description: Inhibition of AKT phosphorylation at S473 in human U-87MG cells at 5 mM after 2 hrs
In DepthDetails ArticlePubMed