BDBM50343225 CHEMBL1773592::N-(6-(2-(3-Fluorophenylthio)pyrimidin-4-yl)benzo[d]thiazol-2-yl)acetamide
SMILES CC(=O)Nc1nc2ccc(cc2s1)-c1ccnc(Sc2cccc(F)c2)n1
InChI Key InChIKey=NUONSZZBOOKGRC-UHFFFAOYSA-N
Data  1 KI  1 IC50
  Tab Delimited (TSV)   2D SDfile   Computed 3D by Vconf -m prep SDfile
Find this compound or compounds like it in BindingDB:
Activity Spreadsheet -- Enzyme Inhibition Constant Data from BindingDB
Found 2 hits for monomerid = 50343225
LigandPNGBDBM50343225(CHEMBL1773592 | N-(6-(2-(3-Fluorophenylthio)pyrimi...)
Affinity DataKi:  31nM. Assay description: Inhibition of human PI3Kalpha expressed in Sf9 cells
In DepthDetails ArticlePubMed
TargetSerine/threonine-protein kinase mTOR(Homo sapiens (Human))
Amgen
Curated by ChEMBL
LigandPNGBDBM50343225(CHEMBL1773592 | N-(6-(2-(3-Fluorophenylthio)pyrimi...)
Affinity DataIC50: >6.00E+3nM. Assay description: Inhibition of mTOR assessed as inhibition of 4EBP1 phosphorylation by TR-FRET assay
In DepthDetails ArticlePubMed