BDBM50343733 (R)-N-omega-[(4-Aminobutyl)aminocarbonyl]-Na-(2,2-diphenylacetyl)-N-(4-hydroxybenzyl)argininamide::CHEMBL1774206
SMILES NCCCCNC(=O)NC(N)=NCCC[C@@H](NC(=O)C(c1ccccc1)c1ccccc1)C(=O)NCc1ccc(O)cc1
InChI Key InChIKey=YJNCRRHFYYPOPG-HHHXNRCGSA-N
Data  1 KI
  Tab Delimited (TSV)   2D SDfile   Computed 3D by Vconf -m prep SDfile
Find this compound or compounds like it in BindingDB:
Activity Spreadsheet -- Enzyme Inhibition Constant Data from BindingDB
Found 1 hit for monomerid = 50343733
TargetNeuropeptide Y receptor type 1(Homo sapiens (Human))
Universit£T Regensburg
Curated by ChEMBL
LigandPNGBDBM50343733((R)-N-omega-[(4-Aminobutyl)aminocarbonyl]-Na-(2,2-...)
Affinity DataKi:  4.30nM. Assay description: Displacement of [3H]-UR-MK114 from Y1R in human SK-N-MC cells
In DepthDetails ArticlePubMed