BDBM50343893 CHEMBL1774994::N-(2-(4-(2-Hydroxyphenyl)piperazin-1-yl)ethyl)-4-iodo-N-(pyridin-2-yl)adamantane-1-carboxamide
SMILES Oc1ccccc1N1CCN(CCN(C(=O)C23CC4CC(C2)C(I)C(C4)C3)c2ccccn2)CC1
InChI Key InChIKey=RTVFEMSFRIRUKX-UHFFFAOYSA-N
Data  1 KI  1 IC50
  Tab Delimited (TSV)   2D SDfile   Computed 3D by Vconf -m prep SDfile
Find this compound or compounds like it in BindingDB:
Activity Spreadsheet -- Enzyme Inhibition Constant Data from BindingDB
Found 2 hits for monomerid = 50343893
Target5-hydroxytryptamine receptor 1A(Homo sapiens (Human))
Vu University Medical Center
Curated by ChEMBL
LigandPNGBDBM50343893(CHEMBL1774994 | N-(2-(4-(2-Hydroxyphenyl)piperazin...)
Affinity DataKi:  1.68nM. Assay description: Displacement of [3H]8-OH-DPAT from human cloned 5HT1A receptor expressed in HEK293 EBNA cells after 1 hr by liquid scintillation counting
In DepthDetails ArticlePubMed
Target5-hydroxytryptamine receptor 1A(Homo sapiens (Human))
Vu University Medical Center
Curated by ChEMBL
LigandPNGBDBM50343893(CHEMBL1774994 | N-(2-(4-(2-Hydroxyphenyl)piperazin...)
Affinity DataIC50:  3.95nM. Assay description: Displacement of [3H]8-OH-DPAT from human cloned 5HT1A receptor expressed in HEK293 EBNA cells after 1 hr by liquid scintillation counting
In DepthDetails ArticlePubMed