BDBM50344439 CHEMBL1780005::rac-(2R)-9,10-dimethoxy-3-(2-methylallyl)-2,3,4,6,7,11b-hexahydro-1H-pyrido[2,1-a]isoquinolin-2-ol
SMILES COc1cc2CCN3CC(CC(C)=C)[C@H](O)CC3c2cc1OC
InChI Key InChIKey=YVWYQSWHQOIBTK-BDVYOWHSSA-N
Data  1 KI
  Tab Delimited (TSV)   2D SDfile   Computed 3D by Vconf -m prep SDfile
Find this compound or compounds like it in BindingDB:
Activity Spreadsheet -- Enzyme Inhibition Constant Data from BindingDB
Found 1 hit for monomerid = 50344439
TargetSynaptic vesicular amine transporter(Rattus norvegicus (Rat))
University Of Pennsylvania
Curated by ChEMBL
LigandPNGBDBM50344439(CHEMBL1780005 | rac-(2R)-9,10-dimethoxy-3-(2-methy...)
Affinity DataKi:  5.98nM. Assay description: Displacement of [125I]-iodovinyl-TBZ from VMAT2 in rat striatal homogenate after 60 mins by gamma counting
In DepthDetails ArticlePubMed