BDBM503447 5-(4-(Difluoromethoxy)-6-((R*)-3,3,3-trifluoro-2-methylpropyl)pyridin-3-yl)-1-ethyl-4-methyl-N-(((1r,4R)-4-(methylsulfonyl)cyclohexyl)methyl)-1H-pyrazole-3-carboxamide::US11034658, Example 19
SMILES CCn1nc(C(=O)NC[C@H]2CC[C@H](C)CC2)c(C)c1-c1cnc(C[C@@H](C)C(F)(F)F)cc1OC(F)F
InChI Key InChIKey=SDZFVXQFYDBZAM-BFYDXBDKSA-N
Data  1 Kd
  Tab Delimited (TSV)   2D SDfile   Computed 3D by Vconf -m prep SDfile
Find this compound or compounds like it in BindingDB:
Activity Spreadsheet -- Enzyme Inhibition Constant Data from BindingDB
Found 1 hit for monomerid = 503447
TargetNuclear receptor ROR-gamma(Homo sapiens (Human))
Janssen Pharmaceutica
US Patent
LigandPNGBDBM503447(5-(4-(Difluoromethoxy)-6-((R*)-3,3,3-trifluoro-2-m...)
Affinity DataKd:  17nM. Assay description: ThermoFluorŪ is a fluorescence based assay that estimates ligand binding affinities by measuring the effect of a ligand on protein thermal stability ...
Ligand InfoPC cidPC sid
In DepthDetails US Patent