BDBM503451 5-(4-(Difluoromethoxy)-6-(3,3,3-trifluoro-2-(trifluoromethyl)propyl)pyridin-3-yl)-1-ethyl-4-methyl-N-(((1r,4r)-4-(methylsulfonyl)cyclohexyl)methyl)-1H-pyrazole-3-carboxamide::US11034658, Example 23
SMILES CCn1nc(C(=O)NC[C@H]2CC[C@H](C)CC2)c(C)c1-c1cnc(CC(C(F)(F)F)C(F)(F)F)cc1OC(F)F
InChI Key InChIKey=IGILPNRZSYJHHU-CTYIDZIISA-N
Data  1 Kd
  Tab Delimited (TSV)   2D SDfile   Computed 3D by Vconf -m prep SDfile
Find this compound or compounds like it in BindingDB:
Activity Spreadsheet -- Enzyme Inhibition Constant Data from BindingDB
Found 1 hit for monomerid = 503451
TargetNuclear receptor ROR-gamma(Homo sapiens (Human))
Janssen Pharmaceutica
US Patent
LigandPNGBDBM503451(5-(4-(Difluoromethoxy)-6-(3,3,3-trifluoro-2-(trifl...)
Affinity DataKd:  2.5nM. Assay description: ThermoFluorŪ is a fluorescence based assay that estimates ligand binding affinities by measuring the effect of a ligand on protein thermal stability ...
Ligand InfoPC cidPC sid
In DepthDetails US Patent