BDBM50345137 (+/-)-(3R)-5-chloro-1-(2,4-dimethoxyphenylsulfonyl)-3-(2-methoxypyridin-3-yl)-3-(2-(oxazol-2-yl)pyrrolidin-1-yl)indolin-2-one::CHEMBL1779415
SMILES COc1ccc(c(OC)c1)S(=O)(=O)N1C(=O)[C@@](N2CCCC2c2ncco2)(c2cc(Cl)ccc12)c1cccnc1OC
InChI Key InChIKey=ASOTVOFICYBESK-IZCXSWDTSA-N
Data  1 KI
  Tab Delimited (TSV)   2D SDfile   Computed 3D by Vconf -m prep SDfile
Find this compound or compounds like it in BindingDB:
Activity Spreadsheet -- Enzyme Inhibition Constant Data from BindingDB
Found 1 hit for monomerid = 50345137
TargetVasopressin V1b receptor(Homo sapiens (Human))
Abbott Laboratories
Curated by ChEMBL
LigandPNGBDBM50345137((+/-)-(3R)-5-chloro-1-(2,4-dimethoxyphenylsulfonyl...)
Affinity DataKi:  101nM. Assay description: Displacement of [3H]AVP from human vasopressin V1b receptor expressed in CHO cells by scintillation counting
In DepthDetails ArticlePubMed