BDBM50345141 (R)-5-chloro-3-(2-methoxy-5-((methylamino)methyl)phenyl)-1-(4-methoxyphenylsulfonyl)-3-((S)-2-(oxazol-2-yl)pyrrolidin-1-yl)indolin-2-one::CHEMBL1779419
SMILES CNCc1ccc(OC)c(c1)[C@@]1(N2CCC[C@H]2c2ncco2)C(=O)N(c2ccc(Cl)cc12)S(=O)(=O)c1ccc(OC)cc1
InChI Key InChIKey=CCDGXHHJZYGCCT-JTSJOTPCSA-N
Data  4 KI
  Tab Delimited (TSV)   2D SDfile   Computed 3D by Vconf -m prep SDfile
Find this compound or compounds like it in BindingDB:
Activity Spreadsheet -- Enzyme Inhibition Constant Data from BindingDB
Found 4 hits for monomerid = 50345141
TargetVasopressin V1b receptor(Homo sapiens (Human))
Abbott Laboratories
Curated by ChEMBL
LigandPNGBDBM50345141((R)-5-chloro-3-(2-methoxy-5-((methylamino)methyl)p...)
Affinity DataKi:  3.90nM. Assay description: Displacement of [3H]AVP from human vasopressin V1b receptor expressed in CHO cells by scintillation counting
In DepthDetails ArticlePubMed
TargetOxytocin receptor(Homo sapiens (Human))
Abbott Laboratories
Curated by ChEMBL
LigandPNGBDBM50345141((R)-5-chloro-3-(2-methoxy-5-((methylamino)methyl)p...)
Affinity DataKi:  135nM. Assay description: Displacement of radiolebelled oxytocin from human oxytocin receptor expressed in CHO cells by scintillation counting
In DepthDetails ArticlePubMed
TargetVasopressin V1a receptor(Homo sapiens (Human))
Abbott Laboratories
Curated by ChEMBL
LigandPNGBDBM50345141((R)-5-chloro-3-(2-methoxy-5-((methylamino)methyl)p...)
Affinity DataKi:  243nM. Assay description: Displacement of [3H]AVP from human vasopressin V1a receptor expressed in CHO cells by scintillation counting
In DepthDetails ArticlePubMed
TargetVasopressin V2 receptor(Homo sapiens (Human))
Abbott Laboratories
Curated by ChEMBL
LigandPNGBDBM50345141((R)-5-chloro-3-(2-methoxy-5-((methylamino)methyl)p...)
Affinity DataKi: >1.00E+3nM. Assay description: Displacement of [3H]AVP from human vasopressin V2 receptor expressed in CHO cells by scintillation counting
In DepthDetails ArticlePubMed