BDBM50345142 (R)-5-chloro-3-(2-methoxy-5-((4-methylpiperazin-1-yl)methyl)phenyl)-1-(4-methoxyphenylsulfonyl)-3-((S)-2-(oxazol-2-yl)pyrrolidin-1-yl)indolin-2-one::CHEMBL1779420
SMILES COc1ccc(cc1)S(=O)(=O)N1C(=O)[C@@](N2CCC[C@H]2c2ncco2)(c2cc(Cl)ccc12)c1cc(CN2CCN(C)CC2)ccc1OC
InChI Key InChIKey=XEJCDFZDXXUIAO-MFACQUFMSA-N
Data  4 KI
  Tab Delimited (TSV)   2D SDfile   Computed 3D by Vconf -m prep SDfile
Find this compound or compounds like it in BindingDB:
Activity Spreadsheet -- Enzyme Inhibition Constant Data from BindingDB
Found 4 hits for monomerid = 50345142
TargetVasopressin V1b receptor(Homo sapiens (Human))
Abbott Laboratories
Curated by ChEMBL
LigandPNGBDBM50345142((R)-5-chloro-3-(2-methoxy-5-((4-methylpiperazin-1-...)
Affinity DataKi:  1.30nM. Assay description: Displacement of [3H]AVP from human vasopressin V1b receptor expressed in CHO cells by scintillation counting
In DepthDetails ArticlePubMed
TargetOxytocin receptor(Homo sapiens (Human))
Abbott Laboratories
Curated by ChEMBL
LigandPNGBDBM50345142((R)-5-chloro-3-(2-methoxy-5-((4-methylpiperazin-1-...)
Affinity DataKi:  89nM. Assay description: Displacement of radiolebelled oxytocin from human oxytocin receptor expressed in CHO cells by scintillation counting
In DepthDetails ArticlePubMed
TargetVasopressin V1a receptor(Homo sapiens (Human))
Abbott Laboratories
Curated by ChEMBL
LigandPNGBDBM50345142((R)-5-chloro-3-(2-methoxy-5-((4-methylpiperazin-1-...)
Affinity DataKi:  231nM. Assay description: Displacement of [3H]AVP from human vasopressin V1a receptor expressed in CHO cells by scintillation counting
In DepthDetails ArticlePubMed
TargetVasopressin V2 receptor(Homo sapiens (Human))
Abbott Laboratories
Curated by ChEMBL
LigandPNGBDBM50345142((R)-5-chloro-3-(2-methoxy-5-((4-methylpiperazin-1-...)
Affinity DataKi: >1.00E+3nM. Assay description: Displacement of [3H]AVP from human vasopressin V2 receptor expressed in CHO cells by scintillation counting
In DepthDetails ArticlePubMed