BDBM50346335 CHEMBL1782241::Cochinchinone A
SMILES [#6]\[#6](-[#6])=[#6]\[#6]-[#6]\[#6](-[#6])=[#6]\[#6]-c1c(-[#8])c(-[#6]\[#6]=[#6](\[#6])-[#6])c(-[#8])c2c1oc1ccc(-[#8])cc1c2=O
InChI Key InChIKey=ZHJQVNDLFGICFY-VCHYOVAHSA-N
Data  2 KI  3 IC50
  Tab Delimited (TSV)   2D SDfile   Computed 3D by Vconf -m prep SDfile
Find this compound or compounds like it in BindingDB:
Activity Spreadsheet -- Enzyme Inhibition Constant Data from BindingDB
Found 5 hits for monomerid = 50346335
TargetTyrosine-protein phosphatase non-receptor type 1(Homo sapiens (Human))
Gyeongsang National University
Curated by ChEMBL
LigandPNGBDBM50346335(CHEMBL1782241 | Cochinchinone A)
Affinity DataKi:  3.10E+3nM. Assay description: Inhibition of recombinant human PTP1B (1 to 322 residues) expressed in Escherichia coli using P-NPP as substrate after 10 mins by Dixon plot analysis
In DepthDetails ArticlePubMed
TargetProbable maltase-glucoamylase 2(Homo sapiens)
Gyeongsang National University
Curated by ChEMBL
LigandPNGBDBM50346335(CHEMBL1782241 | Cochinchinone A)
Affinity DataKi:  1.34E+4nM. Assay description: Inhibition of alpha-glucosidase (unknown origin) using PNP-G as substrate by Dixon plot analysis
In DepthDetails ArticlePubMed
TargetTyrosine-protein phosphatase non-receptor type 1(Homo sapiens (Human))
Gyeongsang National University
Curated by ChEMBL
LigandPNGBDBM50346335(CHEMBL1782241 | Cochinchinone A)
Affinity DataIC50:  5.20E+3nM. Assay description: Inhibition of recombinant human PTP1B (1 to 322 residues) expressed in Escherichia coli using P-NPP as substrate after 10 mins by spectrophotometry
In DepthDetails ArticlePubMed
TargetTranscription factor p65(Homo sapiens (Human))
The Ohio State University
Curated by ChEMBL
LigandPNGBDBM50346335(CHEMBL1782241 | Cochinchinone A)
Affinity DataIC50: >1.00E+4nM. Assay description: Inhibition of NFkappa p65 in nuclear extract of human HeLa cells assessed as blockade of NFkappa p65 binding to biotinylated-consesus sequence by ELI...
In DepthDetails ArticlePubMed
TargetProbable maltase-glucoamylase 2(Homo sapiens)
Gyeongsang National University
Curated by ChEMBL
LigandPNGBDBM50346335(CHEMBL1782241 | Cochinchinone A)
Affinity DataIC50:  1.74E+4nM. Assay description: Inhibition of alpha-glucosidase (unknown origin) using PNP-G as substrate measured for 15 mins by spectrophotometry
In DepthDetails ArticlePubMed