BDBM50346380 3-(3-(4-(naphthalen-1-yl)piperazin-1-yl)propoxy)benzo[d][1,2,3]triazin-4(3H)-one::CHEMBL1783349
SMILES O=c1n(OCCCN2CCN(CC2)c2cccc3ccccc23)nnc2ccccc12
InChI Key InChIKey=DMXFORFTCSBZNW-UHFFFAOYSA-N
Data  4 KI
  Tab Delimited (TSV)   2D SDfile   Computed 3D by Vconf -m prep SDfile
Find this compound or compounds like it in BindingDB:
Activity Spreadsheet -- Enzyme Inhibition Constant Data from BindingDB
Found 4 hits for monomerid = 50346380
TargetD(2) dopamine receptor(Rattus norvegicus (rat))
Universit£
Curated by ChEMBL
LigandPNGBDBM50346380(3-(3-(4-(naphthalen-1-yl)piperazin-1-yl)propoxy)be...)
Affinity DataKi:  85.4nM. Assay description: Displacement of [3H]spiperone from dopamine D2 receptor in rat corpora striatum homogenates after 15 mins by liquid scintillation counting
In DepthDetails ArticlePubMed
Target5-hydroxytryptamine receptor 2A(Rattus norvegicus (rat))
Universit£
Curated by ChEMBL
LigandPNGBDBM50346380(3-(3-(4-(naphthalen-1-yl)piperazin-1-yl)propoxy)be...)
Affinity DataKi:  721nM. Assay description: Displacement of [3H]Ketanserin from 5HT2A receptor in Sprague-Dawley rat frontal cortical homogenates after 15 mins
In DepthDetails ArticlePubMed
TargetD(1A) dopamine receptor(RAT)
Universit£
Curated by ChEMBL
LigandPNGBDBM50346380(3-(3-(4-(naphthalen-1-yl)piperazin-1-yl)propoxy)be...)
Affinity DataKi: >1.00E+4nM. Assay description: Displacement of [3H]SCH 23390 from dopamine D1 receptor in rat corpora striatum homogenates after 15 mins by liquid scintillation counting
In DepthDetails ArticlePubMed
Target5-hydroxytryptamine receptor 1A(Rattus norvegicus (rat))
Universit£
Curated by ChEMBL
LigandPNGBDBM50346380(3-(3-(4-(naphthalen-1-yl)piperazin-1-yl)propoxy)be...)
Affinity DataKi: >1.00E+4nM. Assay description: Displacement of [3H]8-OH-DPAT from 5HT1A receptor in Sprague-Dawley rat brain cortex homogenates after 30 mins by liquid scintillation counting
In DepthDetails ArticlePubMed