BDBM50346551 CHEMBL1795371
SMILES O=[#6]1-[#7]-[#6](=S)-[#7]-[#6](=O)\[#6]-1=[#6]/c1ccc(cc1)-c1ccccc1
InChI Key InChIKey=WCHLHTXYKWJEJW-UHFFFAOYSA-N
Data  9 IC50
  Tab Delimited (TSV)   2D SDfile   Computed 3D by Vconf -m prep SDfile
Find this compound or compounds like it in BindingDB:
Activity Spreadsheet -- Enzyme Inhibition Constant Data from BindingDB
Found 9 hits for monomerid = 50346551
TargetNAD-dependent protein deacetylase sirtuin-2(Homo sapiens (Human))
Martin-Luther University Of Halle-Wittenberg
Curated by ChEMBL
LigandPNGBDBM50346551(CHEMBL1795371)
Affinity DataIC50:  8.70E+3nM. Assay description: Inhibition of human Sirt2
In DepthDetails ArticlePubMed
TargetNAD-dependent protein deacetylase sirtuin-1(Homo sapiens (Human))
Guru Jambheshwar University Of Science And Technology
Curated by ChEMBL
LigandPNGBDBM50346551(CHEMBL1795371)
Affinity DataIC50:  5.10E+4nM. Assay description: Inhibition of recombinant human SIRT1 assessed as inhibition of deacetylase activity using ZMAL as substrate measured after 4 hrs by Fluor de Lys ass...
In DepthDetails ArticlePubMed
TargetNAD-dependent protein deacetylase sirtuin-2(Homo sapiens (Human))
Martin-Luther University Of Halle-Wittenberg
Curated by ChEMBL
LigandPNGBDBM50346551(CHEMBL1795371)
Affinity DataIC50:  8.70E+3nM. Assay description: Inhibition of human N-terminal 6His-tagged SIRT2 assessed as inhibition of deacetylase activity using ZMAL as substrate measured after 4 hrs by Fluor...
In DepthDetails ArticlePubMed
TargetNAD-dependent protein deacetylase sirtuin-2(Homo sapiens (Human))
Martin-Luther University Of Halle-Wittenberg
Curated by ChEMBL
LigandPNGBDBM50346551(CHEMBL1795371)
Affinity DataIC50:  8.70E+3nM. Assay description: Inhibition of recombinant SIRT2 using ZMAL substrate after 4 hrs by homogeneous fluorescence assay
In DepthDetails ArticlePubMed
TargetNAD-dependent protein deacetylase sirtuin-2(Homo sapiens (Human))
Martin-Luther University Of Halle-Wittenberg
Curated by ChEMBL
LigandPNGBDBM50346551(CHEMBL1795371)
Affinity DataIC50:  8.70E+3nM. Assay description: Inhibition of sirtuin 2 (unknown origin)
In DepthDetails ArticlePubMed
TargetNAD-dependent protein deacylase sirtuin-5, mitochondrial(Homo sapiens (Human))
TBA
Curated by ChEMBL
LigandPNGBDBM50346551(CHEMBL1795371)
Affinity DataIC50:  3.00E+4nM. Assay description: Inhibition of SIRT5 using ZK(suc)A substrate after 1 hr by homogeneous fluorescence assay
In DepthDetails ArticlePubMed
TargetNAD-dependent protein deacetylase sirtuin-1(Homo sapiens (Human))
Guru Jambheshwar University Of Science And Technology
Curated by ChEMBL
LigandPNGBDBM50346551(CHEMBL1795371)
Affinity DataIC50:  5.05E+4nM. Assay description: Inhibition of recombinant SIRT1 using ZMAL substrate after 4 hrs by homogeneous fluorescence assay
In DepthDetails ArticlePubMed
TargetNAD-dependent protein deacetylase sirtuin-1(Homo sapiens (Human))
Guru Jambheshwar University Of Science And Technology
Curated by ChEMBL
LigandPNGBDBM50346551(CHEMBL1795371)
Affinity DataIC50:  5.10E+4nM. Assay description: Inhibition of sirtuin 1 (unknown origin)
In DepthDetails ArticlePubMed
LigandPNGBDBM50346551(CHEMBL1795371)
Affinity DataIC50:  4.03E+4nM. Assay description: Inhibition of recombinant SIRT3 using ZMAL substrate after 4 hrs by homogeneous fluorescence assay
In DepthDetails ArticlePubMed