BDBM503469 5-(6-(3,3-Difluoro-2,2-dimethylpropyl)-4-(difluoromethoxy)pyridin-3-yl)-1-ethyl-4-methyl-N-(((1r,4r)-4-(methylsulfonyl)cyclohexyl)methyl)-1H-pyrazole-3-carboxamide::US11034658, Example 41
SMILES CCn1nc(C(=O)NC[C@H]2CC[C@H](C)CC2)c(C)c1-c1cnc(CC(C)(C)C(F)F)cc1OC(F)F
InChI Key InChIKey=HRJIZJGSCWASJO-JCNLHEQBSA-N
Data  1 Kd
  Tab Delimited (TSV)   2D SDfile   Computed 3D by Vconf -m prep SDfile
Find this compound or compounds like it in BindingDB:
Activity Spreadsheet -- Enzyme Inhibition Constant Data from BindingDB
Found 1 hit for monomerid = 503469
TargetNuclear receptor ROR-gamma(Homo sapiens (Human))
Janssen Pharmaceutica
US Patent
LigandPNGBDBM503469(5-(6-(3,3-Difluoro-2,2-dimethylpropyl)-4-(difluoro...)
Affinity DataKd:  6.90nM. Assay description: ThermoFluorŪ is a fluorescence based assay that estimates ligand binding affinities by measuring the effect of a ligand on protein thermal stability ...
Ligand InfoPC cidPC sid
In DepthDetails US Patent