BDBM50346996 CHEMBL1795914
SMILES Cn1ccc(cc1=O)[C@H]1CCNC[C@@H]1C(=O)N(Cc1cc(CCC#N)cc(Cl)c1Cl)C1CC1
InChI Key InChIKey=SBUZQQVTBNOWMS-RTWAWAEBSA-N
Data  1 KI  2 IC50
  Tab Delimited (TSV)   2D SDfile   Computed 3D by Vconf -m prep SDfile
Find this compound or compounds like it in BindingDB:
Activity Spreadsheet -- Enzyme Inhibition Constant Data from BindingDB
Found 3 hits for monomerid = 50346996
TargetPotassium voltage-gated channel subfamily H member 2(Homo sapiens (Human))
Merck Frosst Centre For Therapeutic Research
Curated by ChEMBL
LigandPNGBDBM50346996(CHEMBL1795914)
Affinity DataKi:  1.70E+4nM. Assay description: Inhibition of human ERG
In DepthDetails ArticlePubMed
TargetRenin(Homo sapiens (Human))
Merck Frosst Centre For Therapeutic Research
Curated by ChEMBL
LigandPNGBDBM50346996(CHEMBL1795914)
Affinity DataIC50:  17nM. Assay description: Inhibition of renin in human plasma using Q-FRET substrate pretreated for 10 mins before substrate addition measured after 1 hr
In DepthDetails ArticlePubMed
TargetRenin(Homo sapiens (Human))
Merck Frosst Centre For Therapeutic Research
Curated by ChEMBL
LigandPNGBDBM50346996(CHEMBL1795914)
Affinity DataIC50:  8.5nM. Assay description: Inhibition of renin in human plasma using Q-FRET substrate pretreated for 10 mins before substrate addition measured after 1 hr
In DepthDetails ArticlePubMed