BDBM50347607 CHEMBL1802987
SMILES FC(F)(F)c1ccc2c(c1)[nH]c1ccncc21
InChI Key InChIKey=KIWJOOAVNSHSAY-UHFFFAOYSA-N
Data  2 IC50
  Tab Delimited (TSV)   2D SDfile   Computed 3D by Vconf -m prep SDfile
Find this compound or compounds like it in BindingDB:
Activity Spreadsheet -- Enzyme Inhibition Constant Data from BindingDB
Found 2 hits for monomerid = 50347607
TargetKinesin-like protein KIF11(Homo sapiens (Human))
Kyoto University
Curated by ChEMBL
LigandPNGBDBM50347607(CHEMBL1802987)
Affinity DataIC50:  95nM. Assay description: Inhibition of C-terminally His6-tagged microtubule-activated KSP motor domain ATPase activity after 15 mins by luciferase-derived luminescence assay
In DepthDetails ArticlePubMed
TargetKinesin-like protein KIF11(Homo sapiens (Human))
Kyoto University
Curated by ChEMBL
LigandPNGBDBM50347607(CHEMBL1802987)
Affinity DataIC50:  95nM. Assay description: Inhibition of C-terminal His-tagged KSP ATPase motor domain (unknown origin) expressed in bacteria incubated for 30 mins prior to ATP addition measur...
In DepthDetails ArticlePubMed