BDBM50347608 CHEMBL1802988
SMILES FC(F)(F)c1ccc2c(c1)[nH]c1cccnc21
InChI Key InChIKey=FUJRUJQSDDIUDN-UHFFFAOYSA-N
Data  1 IC50
  Tab Delimited (TSV)   2D SDfile   Computed 3D by Vconf -m prep SDfile
Find this compound or compounds like it in BindingDB:
Activity Spreadsheet -- Enzyme Inhibition Constant Data from BindingDB
Found 1 hit for monomerid = 50347608
TargetKinesin-like protein KIF11(Homo sapiens (Human))
Kyoto University
Curated by ChEMBL
LigandPNGBDBM50347608(CHEMBL1802988)
Affinity DataIC50:  330nM. Assay description: Inhibition of C-terminally His6-tagged microtubule-activated KSP motor domain ATPase activity after 15 mins by luciferase-derived luminescence assay
In DepthDetails ArticlePubMed