BDBM50347613 CHEMBL1803017
SMILES NC(=O)Nc1ccc2c(c1)[nH]c1cc(ccc21)C(F)(F)F
InChI Key InChIKey=JWEBYTUDKRLSAX-UHFFFAOYSA-N
Data  1 IC50
  Tab Delimited (TSV)   2D SDfile   Computed 3D by Vconf -m prep SDfile
Find this compound or compounds like it in BindingDB:
Activity Spreadsheet -- Enzyme Inhibition Constant Data from BindingDB
Found 1 hit for monomerid = 50347613
TargetKinesin-like protein KIF11(Homo sapiens (Human))
Kyoto University
Curated by ChEMBL
LigandPNGBDBM50347613(CHEMBL1803017)
Affinity DataIC50:  85nM. Assay description: Inhibition of C-terminally His6-tagged microtubule-activated KSP motor domain ATPase activity after 15 mins by luciferase-derived luminescence assay
In DepthDetails ArticlePubMed