BDBM50347618 CHEMBL1803022
SMILES FC(F)(F)c1ccc2c(c1)[nH]c1cc3[nH]ccc3cc21
InChI Key InChIKey=HCDAKMLCGAHVQH-UHFFFAOYSA-N
Data  1 IC50
  Tab Delimited (TSV)   2D SDfile   Computed 3D by Vconf -m prep SDfile
Find this compound or compounds like it in BindingDB:
Activity Spreadsheet -- Enzyme Inhibition Constant Data from BindingDB
Found 1 hit for monomerid = 50347618
TargetKinesin-like protein KIF11(Homo sapiens (Human))
Kyoto University
Curated by ChEMBL
LigandPNGBDBM50347618(CHEMBL1803022)
Affinity DataIC50:  170nM. Assay description: Inhibition of C-terminally His6-tagged microtubule-activated KSP motor domain ATPase activity after 15 mins by luciferase-derived luminescence assay
In DepthDetails ArticlePubMed