BDBM50348101 CHEMBL1800333
SMILES NCc1ccc2cc(ccc2c1)C#Cc1ccccc1
InChI Key InChIKey=LRNWTXPYFLNBRD-UHFFFAOYSA-N
Data  1 IC50
  Tab Delimited (TSV)   2D SDfile   Computed 3D by Vconf -m prep SDfile
Find this compound or compounds like it in BindingDB:
Activity Spreadsheet -- Enzyme Inhibition Constant Data from BindingDB
Found 1 hit for monomerid = 50348101
TargetAcid-sensing ion channel 3(Homo sapiens (Human))
Merck Research Laboratories
Curated by ChEMBL
LigandPNGBDBM50348101(CHEMBL1800333)
Affinity DataIC50:  4.80E+3nM. Assay description: Inhibition of ASIC3 assessed as inhibition of peak current by electrophysiology method
In DepthDetails ArticlePubMed