BDBM50348104 CHEMBL1800428
SMILES CC1N(C)CCc2ccc(cc12)C#Cc1ccc2c(Cl)c(CN)sc2c1
InChI Key InChIKey=UYMZHKCKCWLNFW-UHFFFAOYSA-N
Data  1 IC50
  Tab Delimited (TSV)   2D SDfile   Computed 3D by Vconf -m prep SDfile
Find this compound or compounds like it in BindingDB:
Activity Spreadsheet -- Enzyme Inhibition Constant Data from BindingDB
Found 1 hit for monomerid = 50348104
TargetAcid-sensing ion channel 3(Homo sapiens (Human))
Merck Research Laboratories
Curated by ChEMBL
LigandPNGBDBM50348104(CHEMBL1800428)
Affinity DataIC50:  270nM. Assay description: Inhibition of ASIC3 assessed as inhibition of peak current by electrophysiology method
In DepthDetails ArticlePubMed