BDBM50348111 CHEMBL1800436
SMILES CN(C)C1CCCc2c(cccc12)C#Cc1ccc2c(Cl)c(CN)sc2c1
InChI Key InChIKey=SWCDFJVHIVCGDZ-UHFFFAOYSA-N
Data  1 IC50
  Tab Delimited (TSV)   2D SDfile   Computed 3D by Vconf -m prep SDfile
Find this compound or compounds like it in BindingDB:
Activity Spreadsheet -- Enzyme Inhibition Constant Data from BindingDB
Found 1 hit for monomerid = 50348111
TargetAcid-sensing ion channel 3(Homo sapiens (Human))
Merck Research Laboratories
Curated by ChEMBL
LigandPNGBDBM50348111(CHEMBL1800436)
Affinity DataIC50:  230nM. Assay description: Inhibition of ASIC3 assessed as inhibition of peak current by electrophysiology method
In DepthDetails ArticlePubMed