BDBM50348175 CHEMBL1800865
SMILES CC[C@@H]1Cn2c(N1)c1nc(nc1n(C)c2=O)-c1ccccc1
InChI Key InChIKey=XNWDEMWJNJVCBD-LLVKDONJSA-N
Data  1 Kd
  Tab Delimited (TSV)   2D SDfile   Computed 3D by Vconf -m prep SDfile
Find this compound or compounds like it in BindingDB:
Activity Spreadsheet -- Enzyme Inhibition Constant Data from BindingDB
Found 1 hit for monomerid = 50348175
TargetAdenosine receptor A3(Homo sapiens (Human))
Universit£
Curated by ChEMBL
LigandPNGBDBM50348175(CHEMBL1800865)
Affinity DataKd:  4.90nM. Assay description: Binding affinity to human recombinant A3 adenosine receptor expressed in CHO cells
In DepthDetails ArticlePubMed