BDBM503485 4-Chloro-1-ethyl-5-(4-ethyl-6-((R*)-3,3,3-trifluoro-2-methylpropyl)pyridin-3-yl)-N-((1r,4R)-4-(methylsulfonyl)cyclohexyl)methyl)-1H-pyrazole-3-carboxamide::US11034658, Example 57
SMILES CCc1cc(C[C@@H](C)C(F)(F)F)ncc1-c1c(Cl)c(nn1CC)C(=O)NC[C@H]1CC[C@H](C)CC1
InChI Key InChIKey=DBJWDLHHPMNCLQ-BRWVUGGUSA-N
Data  1 Kd
  Tab Delimited (TSV)   2D SDfile   Computed 3D by Vconf -m prep SDfile
Find this compound or compounds like it in BindingDB:
Activity Spreadsheet -- Enzyme Inhibition Constant Data from BindingDB
Found 1 hit for monomerid = 503485
TargetNuclear receptor ROR-gamma(Homo sapiens (Human))
Janssen Pharmaceutica
US Patent
LigandPNGBDBM503485(4-Chloro-1-ethyl-5-(4-ethyl-6-((R*)-3,3,3-trifluor...)
Affinity DataKd:  20nM. Assay description: ThermoFluorŪ is a fluorescence based assay that estimates ligand binding affinities by measuring the effect of a ligand on protein thermal stability ...
Ligand InfoPC cidPC sid
In DepthDetails US Patent