BDBM50348727 CHEMBL1801501
SMILES COc1ccnc2n(Cc3cc(=O)[nH]c4c(F)c(F)ccc34)c(nc12)C1CCC1
InChI Key InChIKey=OBPMKZUKZANIQJ-UHFFFAOYSA-N
Data  3 EC50
  Tab Delimited (TSV)   2D SDfile   Computed 3D by Vconf -m prep SDfile
Find this compound or compounds like it in BindingDB:
Activity Spreadsheet -- Enzyme Inhibition Constant Data from BindingDB
Found 3 hits for monomerid = 50348727
TargetNitric oxide synthase, endothelial(Homo sapiens (Human))
Kalypsys
Curated by ChEMBL
LigandPNGBDBM50348727(CHEMBL1801501)
Affinity DataEC50: >1.00E+5nM. Assay description: Inhibition of human eNOS expressed in HEK293 cells assessed as inhibition A23187 induced nitric oxide production incubated for 24 hrs measured after ...
In DepthDetails ArticlePubMed
TargetNitric oxide synthase, brain(Homo sapiens (Human))
Kalypsys
Curated by ChEMBL
LigandPNGBDBM50348727(CHEMBL1801501)
Affinity DataEC50:  1.30E+3nM. Assay description: Inhibition of human nNOS expressed in HEK293 cells assessed as inhibition ionomycin induced nitric oxide production incubated for 24 hrs measured aft...
In DepthDetails ArticlePubMed
TargetNitric oxide synthase, inducible(Homo sapiens (Human))
Kalypsys
Curated by ChEMBL
LigandPNGBDBM50348727(CHEMBL1801501)
Affinity DataEC50:  210nM. Assay description: Inhibition of human iNOS expressed in HEK293 cells assessed as inhibition of nitric oxide production after 18 hrs using 2,3-diaminonaphthalene by flu...
In DepthDetails ArticlePubMed