BDBM50348743 CHEMBL1801493
SMILES Fc1ccc2c(Cn3c(CC4CCC4)nc4ccccc34)cc(=O)[nH]c2c1F
InChI Key InChIKey=YPQASLRTQUGFHD-UHFFFAOYSA-N
Data  3 EC50
  Tab Delimited (TSV)   2D SDfile   Computed 3D by Vconf -m prep SDfile
Find this compound or compounds like it in BindingDB:
Activity Spreadsheet -- Enzyme Inhibition Constant Data from BindingDB
Found 3 hits for monomerid = 50348743
TargetNitric oxide synthase, inducible(Homo sapiens (Human))
Kalypsys
Curated by ChEMBL
LigandPNGBDBM50348743(CHEMBL1801493)
Affinity DataEC50:  540nM. Assay description: Inhibition of human iNOS expressed in HEK293 cells assessed as inhibition of nitric oxide production after 18 hrs using 2,3-diaminonaphthalene by flu...
In DepthDetails ArticlePubMed
TargetNitric oxide synthase, endothelial(Homo sapiens (Human))
Kalypsys
Curated by ChEMBL
LigandPNGBDBM50348743(CHEMBL1801493)
Affinity DataEC50:  2.90E+3nM. Assay description: Inhibition of human eNOS expressed in HEK293 cells assessed as inhibition A23187 induced nitric oxide production incubated for 24 hrs measured after ...
In DepthDetails ArticlePubMed
TargetNitric oxide synthase, brain(Homo sapiens (Human))
Kalypsys
Curated by ChEMBL
LigandPNGBDBM50348743(CHEMBL1801493)
Affinity DataEC50:  650nM. Assay description: Inhibition of human nNOS expressed in HEK293 cells assessed as inhibition ionomycin induced nitric oxide production incubated for 24 hrs measured aft...
In DepthDetails ArticlePubMed