BDBM503492 4-Chloro-1-ethyl-5-(4-methoxy-6-(((S)-1,1,1-trifluoropropan-2-yl)oxy)pyridin-3-yl)-N-((1r,4S)-4-(methylsulfonyl)cyclohexyl)methyl)-1H-pyrazole-3-carboxamide::US11034658, Example 64
SMILES CCn1nc(C(=O)NC[C@H]2CC[C@H](C)CC2)c(Cl)c1-c1cnc(O[C@@H](C)C(F)(F)F)cc1OC
InChI Key InChIKey=WCWTXXRJQBJHIZ-KKUMJFAQSA-N
Data  1 Kd
  Tab Delimited (TSV)   2D SDfile   Computed 3D by Vconf -m prep SDfile
Find this compound or compounds like it in BindingDB:
Activity Spreadsheet -- Enzyme Inhibition Constant Data from BindingDB
Found 1 hit for monomerid = 503492
TargetNuclear receptor ROR-gamma(Homo sapiens (Human))
Janssen Pharmaceutica
US Patent
LigandPNGBDBM503492(4-Chloro-1-ethyl-5-(4-methoxy-6-(((S)-1,1,1-triflu...)
Affinity DataKd:  15nM. Assay description: ThermoFluorŪ is a fluorescence based assay that estimates ligand binding affinities by measuring the effect of a ligand on protein thermal stability ...
Ligand InfoPC cidPC sid
In DepthDetails US Patent