BDBM50349365 CHEMBL1809220
SMILES NC(=N)c1ccc(CNC(=O)[C@@H]2CCCN2C(=O)[C@@H](Cc2ccccc2)NS(=O)(=O)Cc2ccccc2)cc1
InChI Key InChIKey=VAMQUIIDPUWWSK-FTJBHMTQSA-N
Data  1 KI
PDB links: 1 PDB ID matches this monomer.
  Tab Delimited (TSV)   2D SDfile   Computed 3D by Vconf -m prep SDfile
Find this compound or compounds like it in BindingDB:
Activity Spreadsheet -- Enzyme Inhibition Constant Data from BindingDB
Found 1 hit for monomerid = 50349365
TargetTransmembrane protease serine 11D(Homo sapiens (Human))
Philipps University Marburg
Curated by ChEMBL
LigandPNGBDBM50349365(CHEMBL1809220)
Affinity DataKi:  98nM. Assay description: Inhibition of human recombinant airway trypsin-like protease HAT using D-cyclohexylalanine-Pro-Arg-AMC as substrate by fluorescence plate reader anal...
In DepthDetails ArticlePubMed