BDBM50349382 CHEMBL1808470
SMILES CC(C)Cc1nc2ccc(cc2c(-c2ccc(C)cc2)c1CN)C(O)=O
InChI Key InChIKey=DDOHWXNQVKAETF-UHFFFAOYSA-N
Data  1 IC50
  Tab Delimited (TSV)   2D SDfile   Computed 3D by Vconf -m prep SDfile
Find this compound or compounds like it in BindingDB:
Activity Spreadsheet -- Enzyme Inhibition Constant Data from BindingDB
Found 1 hit for monomerid = 50349382
TargetDipeptidyl peptidase 4(Homo sapiens (Human))
Takeda Pharmaceutical
Curated by ChEMBL
LigandPNGBDBM50349382(CHEMBL1808470)
Affinity DataIC50:  100nM. Assay description: Inhibition of human Dipeptidyl peptidase-4 expressed in Caco-2 cells using Gly-Pro-pNA.Tos as substrate after 60 mins by microplate reader analysis
In DepthDetails ArticlePubMed