BDBM503495 US11034661, Example 2
SMILES OCC(=O)N1CC(C1)Oc1nonc1\C(N[C@H]1Cc2ccc(F)cc12)=N\O
InChI Key InChIKey=JOXHQHNXTMZZAV-LBPRGKRZSA-N
Data  1 IC50
  Tab Delimited (TSV)   2D SDfile   Computed 3D by Vconf -m prep SDfile
Find this compound or compounds like it in BindingDB:
Activity Spreadsheet -- Enzyme Inhibition Constant Data from BindingDB
Found 1 hit for monomerid = 503495
TargetIndoleamine 2,3-dioxygenase 1(Homo sapiens (Human))
Merck Sharp & Dohme
US Patent
LigandPNGBDBM503495(US11034661, Example 2)
Affinity DataIC50:  75.7nM. Assay description: HIS-tagged IDO1 protein was recombinantly expressed in Escherichia coli using ZYP5052 autoinduction media supplemented with 500 μM delta aminole...
Ligand InfoPC cidPC sid
In DepthDetails US Patent