BDBM50350107 CHEMBL1230692
SMILES Nc1ncnc2n(cnc12)[C@@H]1O[C@H](CO[P@@](O)(=O)O[P@](O)(=O)OC[C@H]2NC[C@H](O)[C@@H]2O)[C@@H](O)[C@H]1O
InChI Key InChIKey=NDQDTBCXPOIQGT-UHNJQBFTSA-N
Data  6 IC50
PDB links: 11 PDB IDs match this monomer.
  Tab Delimited (TSV)   2D SDfile   Computed 3D by Vconf -m prep SDfile
Find this compound or compounds like it in BindingDB:
Activity Spreadsheet -- Enzyme Inhibition Constant Data from BindingDB
Found 6 hits for monomerid = 50350107
TargetPoly(ADP-ribose) glycohydrolase(Rattus norvegicus)
Kumamoto Health Science University
Curated by ChEMBL
LigandPNGBDBM50350107(CHEMBL1230692)
Affinity DataIC50:  100nM. Assay description: Inhibition of rat testis GST-tagged PARG catalytic activity after 30 mins using [32P]poly(ADP-ribose) by radioassay
TargetPoly(ADP-ribose) glycohydrolase(Homo sapiens (Human))
University Of Arizona
Curated by ChEMBL
LigandPNGBDBM50350107(CHEMBL1230692)
Affinity DataIC50:  120nM. Assay description: Inhibition of PARG using [alpha-32P]ADP-ribose polymers after 5 mins by TRAP assay
TargetPoly(ADP-ribose) glycohydrolase(Bos taurus)
University Of Kentucky
Curated by ChEMBL
LigandPNGBDBM50350107(CHEMBL1230692)
Affinity DataIC50:  1.40E+3nM. Assay description: The compound was tested for its ability to inhibit recombinant bovine polyadenosine diphosphoribose glycohydrolase catalytic fragment (rPARG-CF)
TargetPoly(ADP-ribose) glycohydrolase(Bos taurus)
University Of Kentucky
Curated by ChEMBL
LigandPNGBDBM50350107(CHEMBL1230692)
Affinity DataIC50:  330nM. Assay description: The compound was tested for its ability to inhibit bovine thymus polyadenosine diphosphoribose glycohydrolase (bPARG)
TargetPoly(ADP-ribose) glycohydrolase(Bos taurus)
University Of Kentucky
Curated by ChEMBL
LigandPNGBDBM50350107(CHEMBL1230692)
Affinity DataIC50:  1.00E+3nM. Assay description: The compound was tested for its ability to inhibit recombinant bovine polyadenosine diphosphoribose glycohydrolase catalytic fragment (rPARG-CF)
TargetPoly [ADP-ribose] polymerase 1(Homo sapiens (Human))
University Of Arizona
Curated by ChEMBL
LigandPNGBDBM50350107(CHEMBL1230692)
Affinity DataIC50: >1.00E+6nM. Assay description: Inhibition of PARP-1 using [32P]-NAD+ after 15 mins
In DepthDetails ArticlePubMed