BDBM50350162 CHEMBL1814469
SMILES COc1cccc2c(O)c(cnc12)C(=O)NC12CC3CC(CC(C3)C1)C2
InChI Key InChIKey=LACXQCASFRBULF-UHFFFAOYSA-N
Data  2 KI
  Tab Delimited (TSV)   2D SDfile   Computed 3D by Vconf -m prep SDfile
Find this compound or compounds like it in BindingDB:
Activity Spreadsheet -- Enzyme Inhibition Constant Data from BindingDB
Found 2 hits for monomerid = 50350162
TargetCannabinoid receptor 2(Homo sapiens (Human))
Universita Degli Studi Di Siena
Curated by ChEMBL
LigandPNGBDBM50350162(CHEMBL1814469)
Affinity DataKi:  3.44E+3nM. Assay description: Displacement of [3H]CP-55940 from human recombinant CB2 receptor expressed in HEK cells
In DepthDetails ArticlePubMed
TargetCannabinoid receptor 1(Homo sapiens (Human))
Universita Degli Studi Di Siena
Curated by ChEMBL
LigandPNGBDBM50350162(CHEMBL1814469)
Affinity DataKi: >1.00E+4nM. Assay description: Displacement of [3H]CP-55940 from human recombinant CB1 receptor expressed in HEK cells
In DepthDetails ArticlePubMed