BDBM50350168 CHEMBL1814740
SMILES N[C@@H](CC(=O)N1CCN(CC1)C(c1ccccc1)c1ccc(Cl)cc1)C(=O)N1Cc2ccc(F)cc2C1
InChI Key InChIKey=QFXCEXQJGXBAQP-QODXOHEASA-N
Data  3 IC50
  Tab Delimited (TSV)   2D SDfile   Computed 3D by Vconf -m prep SDfile
Find this compound or compounds like it in BindingDB:
Activity Spreadsheet -- Enzyme Inhibition Constant Data from BindingDB
Found 3 hits for monomerid = 50350168
TargetDipeptidyl peptidase 8(Homo sapiens (Human))
University Of Antwerp (Ua)
Curated by ChEMBL
LigandPNGBDBM50350168(CHEMBL1814740)
Affinity DataIC50:  8.80nM. Assay description: Inhibition of recombinant human DPP8 assessed as pNA release from Ala-Pro- p-nitroanilide substrate pre-incubated with enzyme for 15 min prior to sub...
In DepthDetails ArticlePubMed
TargetDipeptidyl peptidase 2(Homo sapiens (Human))
University Of Antwerp (Ua)
Curated by ChEMBL
LigandPNGBDBM50350168(CHEMBL1814740)
Affinity DataIC50: >2.50E+4nM. Assay description: Inhibition of human seminal plasma DPP2 assessed as pNA release from Lys-Ala-p-nitroanilide substrate pre-incubated with enzyme for 15 min prior to s...
In DepthDetails ArticlePubMed
TargetDipeptidyl peptidase 4(Homo sapiens (Human))
University Of Antwerp (Ua)
Curated by ChEMBL
LigandPNGBDBM50350168(CHEMBL1814740)
Affinity DataIC50: >1.00E+5nM. Assay description: Inhibition of human seminal plasma DPP4 assessed as pNA release from Gly-Pro-p-nitroanilide substrate pre-incubated with enzyme for 15 min prior to s...
In DepthDetails ArticlePubMed