BDBM50350327 CHEMBL1812857
SMILES CCCCCCC(=O)C(=O)CCCCCC
InChI Key InChIKey=ZSKKAJLPNIHYRI-UHFFFAOYSA-N
Data  8 KI
  Tab Delimited (TSV)   2D SDfile   Computed 3D by Vconf -m prep SDfile
Find this compound or compounds like it in BindingDB:
Activity Spreadsheet -- Enzyme Inhibition Constant Data from BindingDB
Found 8 hits for monomerid = 50350327
TargetLiver carboxylesterase 1(Homo sapiens (Human))
St. Jude Children'S Research Hospital
Curated by ChEMBL
LigandPNGBDBM50350327(CHEMBL1812857)
Affinity DataKi:  4.80nM. Assay description: Inhibition of human CE1 using o-NPA as substrate by spectrophotometric assay
In DepthDetails ArticlePubMed
TargetLiver carboxylesterase 1(Homo sapiens (Human))
St. Jude Children'S Research Hospital
Curated by ChEMBL
LigandPNGBDBM50350327(CHEMBL1812857)
Affinity DataKi:  4.80nM. Assay description: Inhibition of human liver carboxylesterase1 using o-nitrophenyl acetate as substrate after 5 mins by spectrophotometry
In DepthDetails ArticlePubMed
TargetLiver carboxylesterase 1(Oryctolagus cuniculus (rabbit))
St. Jude Children'S Research Hospital
Curated by ChEMBL
LigandPNGBDBM50350327(CHEMBL1812857)
Affinity DataKi:  15.1nM. Assay description: Inhibition of rabbit liver carboxylesterase using o-nitrophenyl acetate as substrate after for 5 mins by spectrophotometry
In DepthDetails ArticlePubMed
TargetCocaine esterase(Homo sapiens (Human))
St. Jude Children'S Research Hospital
Curated by ChEMBL
LigandPNGBDBM50350327(CHEMBL1812857)
Affinity DataKi:  76.4nM. Assay description: Inhibition of human intestinal carboxylesterase using o-nitrophenyl acetate as substrate after 5 mins by spectrophotometry
In DepthDetails ArticlePubMed
TargetCocaine esterase(Homo sapiens (Human))
St. Jude Children'S Research Hospital
Curated by ChEMBL
LigandPNGBDBM50350327(CHEMBL1812857)
Affinity DataKi:  77nM. Assay description: Inhibition of human iCE using o-NPA as substrate by spectrophotometric assay
In DepthDetails ArticlePubMed
TargetCocaine esterase(Homo sapiens (Human))
St. Jude Children'S Research Hospital
Curated by ChEMBL
LigandPNGBDBM50350327(CHEMBL1812857)
Affinity DataKi:  271nM. Assay description: Inhibition of human intestinal carboxylesterase assessed as hydrolysis of CPT-11 after 5 mins by HPLC
In DepthDetails ArticlePubMed
TargetCholinesterase(Homo sapiens (Human))
St. Jude Children'S Research Hospital
Curated by ChEMBL
LigandPNGBDBM50350327(CHEMBL1812857)
Affinity DataKi: >1.00E+5nM. Assay description: Inhibition of human butyrylcholinesterase using butyrylthiocholine as substrate by spectrophotometry
In DepthDetails ArticlePubMed
TargetAcetylcholinesterase(Homo sapiens (Human))
St. Jude Children'S Research Hospital
Curated by ChEMBL
LigandPNGBDBM50350327(CHEMBL1812857)
Affinity DataKi: >1.00E+5nM. Assay description: Inhibition of human acetylcholinesterase using acetylthiocholine as substrate by spectrophotometry
In DepthDetails ArticlePubMed