BDBM503504 4-[2-(carbamoylamino)ethoxy]-N- (4-fluorobicyclo[4.2.0]octa-1,3,5- trien-7-yl)-N'-hydroxy-1,2,5- oxadiazole-3-carboximidamide::US11034661, Example 11
SMILES NC(=O)NCCOc1nonc1\C(NC1Cc2ccc(F)cc12)=N\O
InChI Key InChIKey=UAMXPBYPKRXKMI-UHFFFAOYSA-N
Data  1 IC50
  Tab Delimited (TSV)   2D SDfile   Computed 3D by Vconf -m prep SDfile
Find this compound or compounds like it in BindingDB:
Activity Spreadsheet -- Enzyme Inhibition Constant Data from BindingDB
Found 1 hit for monomerid = 503504
TargetIndoleamine 2,3-dioxygenase 1(Homo sapiens (Human))
Merck Sharp & Dohme
US Patent
LigandPNGBDBM503504(4-[2-(carbamoylamino)ethoxy]-N- (4-fluorobicyclo[...)
Affinity DataIC50:  74.8nM. Assay description: HIS-tagged IDO1 protein was recombinantly expressed in Escherichia coli using ZYP5052 autoinduction media supplemented with 500 μM delta aminole...
Ligand InfoPC cidPC sid
In DepthDetails US Patent