BDBM50350463 CHEMBL1814489
SMILES CC(C)C[C@H](NC(=O)[C@@H](NC(=O)[C@H](C)N)C(C)C)C(O)=O
InChI Key InChIKey=RFJNDTQGEJRBHO-DCAQKATOSA-N
Data  1 KI
  Tab Delimited (TSV)   2D SDfile   Computed 3D by Vconf -m prep SDfile
Find this compound or compounds like it in BindingDB:
Activity Spreadsheet -- Enzyme Inhibition Constant Data from BindingDB
Found 1 hit for monomerid = 50350463
TargetSolute carrier family 15 member 2(Homo sapiens (Human))
Universit£
Curated by ChEMBL
LigandPNGBDBM50350463(CHEMBL1814489)
Affinity DataKi:  1.20E+4nM. Assay description: Binding affinity to human PepT2 in SKTP cells
In DepthDetails ArticlePubMed