BDBM503506 2-[(4-{N-[(1S)-6-fluoro-2,3- dihydro-1H-inden-1-yl]-N'- hydroxycarbamimidoyl}-1,2,5- oxadiazol-3-yl)oxy]-N-(2- hydroxyethyl)acetamide::US11034661, Example 13
SMILES OCCNC(=O)COc1nonc1\C(N[C@H]1CCc2ccc(F)cc12)=N\O
InChI Key InChIKey=MWPMDXLJUWMUOD-LBPRGKRZSA-N
Data  1 IC50
  Tab Delimited (TSV)   2D SDfile   Computed 3D by Vconf -m prep SDfile
Find this compound or compounds like it in BindingDB:
Activity Spreadsheet -- Enzyme Inhibition Constant Data from BindingDB
Found 1 hit for monomerid = 503506
TargetIndoleamine 2,3-dioxygenase 1(Homo sapiens (Human))
Merck Sharp & Dohme
US Patent
LigandPNGBDBM503506(2-[(4-{N-[(1S)-6-fluoro-2,3- dihydro-1H-inden-1-y...)
Affinity DataIC50:  483nM. Assay description: HIS-tagged IDO1 protein was recombinantly expressed in Escherichia coli using ZYP5052 autoinduction media supplemented with 500 μM delta aminole...
Ligand InfoKEGGPC cidPC sid
In DepthDetails US Patent