BDBM50351215 CHEMBL1818415
SMILES COc1ccc(NC(=O)NC2C3CC4CC(C3)CC2C4)cc1
InChI Key InChIKey=XMDMNOXHNSLROT-UHFFFAOYSA-N
Data  1 IC50
  Tab Delimited (TSV)   2D SDfile   Computed 3D by Vconf -m prep SDfile
Find this compound or compounds like it in BindingDB:
Activity Spreadsheet -- Enzyme Inhibition Constant Data from BindingDB
Found 1 hit for monomerid = 50351215
TargetBifunctional epoxide hydrolase 2(Homo sapiens (Human))
St. Jude Children'S Research Hospital
Curated by ChEMBL
LigandPNGBDBM50351215(CHEMBL1818415)
Affinity DataIC50:  14.3nM. Assay description: Inhibition of human recombinant soluble epoxide hydrolase using CMNPC as substrate after 10 mins by fluorescent assay
In DepthDetails ArticlePubMed