BDBM50351241 CHEMBL1818391
SMILES Fc1ccc(NC(=O)NC2CCCCC2)c(F)c1F
InChI Key InChIKey=KSZYHETXSCWRPW-UHFFFAOYSA-N
Data  1 IC50
  Tab Delimited (TSV)   2D SDfile   Computed 3D by Vconf -m prep SDfile
Find this compound or compounds like it in BindingDB:
Activity Spreadsheet -- Enzyme Inhibition Constant Data from BindingDB
Found 1 hit for monomerid = 50351241
TargetBifunctional epoxide hydrolase 2(Homo sapiens (Human))
St. Jude Children'S Research Hospital
Curated by ChEMBL
LigandPNGBDBM50351241(CHEMBL1818391)
Affinity DataIC50:  1.20nM. Assay description: Inhibition of human recombinant soluble epoxide hydrolase using CMNPC as substrate after 10 mins by fluorescent assay
In DepthDetails ArticlePubMed