BDBM50351244 CHEMBL1818388
SMILES CC1C2CC(CC1NC(=O)Nc1ccc(F)c(F)c1F)C2(C)C
InChI Key InChIKey=BVLMUEUIQIASQJ-UHFFFAOYSA-N
Data  1 IC50
  Tab Delimited (TSV)   2D SDfile   Computed 3D by Vconf -m prep SDfile
Find this compound or compounds like it in BindingDB:
Activity Spreadsheet -- Enzyme Inhibition Constant Data from BindingDB
Found 1 hit for monomerid = 50351244
TargetBifunctional epoxide hydrolase 2(Homo sapiens (Human))
St. Jude Children'S Research Hospital
Curated by ChEMBL
LigandPNGBDBM50351244(CHEMBL1818388)
Affinity DataIC50:  0.400nM. Assay description: Inhibition of human recombinant soluble epoxide hydrolase using CMNPC as substrate after 10 mins by fluorescent assay
In DepthDetails ArticlePubMed