BDBM50351249 CHEMBL1818521
SMILES ClCC(=O)NCCCCCCCCCC(=O)CC(=O)N[C@H]1CCOC1=O
InChI Key InChIKey=FMEFMSUNWVCETI-HNNXBMFYSA-N
Data  1 IC50
  Tab Delimited (TSV)   2D SDfile   Computed 3D by Vconf -m prep SDfile
Find this compound or compounds like it in BindingDB:
Activity Spreadsheet -- Enzyme Inhibition Constant Data from BindingDB
Found 1 hit for monomerid = 50351249
TargetTranscriptional activator protein LasR(Pseudomonas aeruginosa)
Florida International University
Curated by ChEMBL
LigandPNGBDBM50351249(CHEMBL1818521)
Affinity DataIC50:  1.10E+3nM. Assay description: Inhibition of Pseudomonas aeruginosa LasR
In DepthDetails ArticlePubMed