BDBM50351250 CHEMBL1818522
SMILES CCCCCCCCCC(=O)CC(=O)NC1CCCCC1=O
InChI Key InChIKey=JDVHCWYKJODEND-UHFFFAOYSA-N
Data  1 IC50
  Tab Delimited (TSV)   2D SDfile   Computed 3D by Vconf -m prep SDfile
Find this compound or compounds like it in BindingDB:
Activity Spreadsheet -- Enzyme Inhibition Constant Data from BindingDB
Found 1 hit for monomerid = 50351250
TargetTranscriptional activator protein LasR(Pseudomonas aeruginosa)
Florida International University
Curated by ChEMBL
LigandPNGBDBM50351250(CHEMBL1818522)
Affinity DataIC50:  1.00E+4nM. Assay description: Inhibition of Pseudomonas aeruginosa LasR
In DepthDetails ArticlePubMed