BDBM50351506 CHEMBL1823934
SMILES O=C(CCCCCCCCCN=C=S)CC(=O)N[C@H]1CCOC1=O
InChI Key InChIKey=OGDSYRZYJUKJBP-HNNXBMFYSA-N
Data  3 IC50
  Tab Delimited (TSV)   2D SDfile   Computed 3D by Vconf -m prep SDfile
Find this compound or compounds like it in BindingDB:
Activity Spreadsheet -- Enzyme Inhibition Constant Data from BindingDB
Found 3 hits for monomerid = 50351506
TargetTranscriptional activator protein LasR(Pseudomonas aeruginosa)
Rowan University
Curated by ChEMBL
LigandPNGBDBM50351506(CHEMBL1823934)
Affinity DataIC50:  3.00E+4nM. Assay description: Antagonist activity at Pseudomonas aeruginosa LasR
In DepthDetails ArticlePubMed
TargetTranscriptional activator protein LasR(Pseudomonas aeruginosa)
Rowan University
Curated by ChEMBL
LigandPNGBDBM50351506(CHEMBL1823934)
Affinity DataIC50:  1.34E+5nM. Assay description: Antagonist activity at Pseudomonas aeruginosa LasR expressed in Escherichia coli DH5alpha assessed as inhibition of ONPG-induced receptor activation ...
In DepthDetails ArticlePubMed
TargetTranscriptional activator protein LasR(Pseudomonas aeruginosa)
Rowan University
Curated by ChEMBL
LigandPNGBDBM50351506(CHEMBL1823934)
Affinity DataIC50:  1.13E+5nM. Assay description: Antagonist activity at Pseudomonas aeruginosa LasR receptor assessed as inhibition of bioluminescence by reporter gene assay
In DepthDetails ArticlePubMed